deps: update amaro to 1.2.1 #83655
Annotations
10 errors and 2 notices
|
test-macOS:
test/parallel/test-runner-coverage-default-exclusion.mjs#L92
--- stderr ---
[process 76512]: --- stderr ---
[process 76512]: --- stdout ---
TAP version 13
# Subtest: foo returns 1
ok 1 - foo returns 1
---
duration_ms: 0.515333
type: 'test'
...
# Subtest: foo returns 1
ok 2 - foo returns 1
---
duration_ms: 0.843
type: 'test'
...
# node:internal/bootstrap/realm:470
# if (!mod) throw new TypeError(`Missing internal module '${id}'`);
# ^
# TypeError: Missing internal module 'internal/deps/./internal.js'
# at requireBuiltin (node:internal/bootstrap/realm:470:19)
# at requireWithFallbackInDeps (node:internal/bootstrap/realm:482:10)
# at node:internal/deps/amaro/dist/index:24:23
# at BuiltinModule.compileForInternalLoader (node:internal/bootstrap/realm:440:7)
# at requireBuiltin (node:internal/bootstrap/realm:471:14)
# at node:internal/modules/typescript:36:17
# at node:internal/util:777:15
# at parseTypeScript (node:internal/modules/typescript:47:17)
# at processTypeScriptCode (node:internal/modules/typescript:129:37)
# at Object.stripTypeScriptModuleTypes (node:internal/modules/typescript:172:22)
# Node.js v27.0.0-pre
# Subtest: file.test.ts
not ok 3 - file.test.ts
---
duration_ms: 43.622708
type: 'test'
location: '/Users/runner/work/node/node/node/test/.tmp.3548/file.test.ts:1:1'
failureType: 'testCodeFailure'
exitCode: 1
signal: ~
error: 'test failed'
code: 'ERR_TEST_FAILURE'
...
# Subtest: foo returns 1
ok 4 - foo returns 1
---
duration_ms: 0.685084
type: 'test'
...
# Subtest: foo returns 1
ok 5 - foo returns 1
---
duration_ms: 0.513541
type: 'test'
...
1..5
# tests 5
# suites 0
# pass 4
# fail 1
# cancelled 0
# skipped 0
# todo 0
# duration_ms 169.788417
# start of coverage report
# --------------------------------------------------------------
# file | line % | branch % | funcs % | uncovered lines
# --------------------------------------------------------------
# logic-file.js | 66.67 | 100.00 | 50.00 | 5-7
# --------------------------------------------------------------
# all files | 66.67 | 100.00 | 50.00 |
# --------------------------------------------------------------
# end of coverage report
[process 76512]: status = 1, signal = null
--- stdout ---
Test failure: 'should exclude ts test files'
Location: test/parallel/test-runner-coverage-default-exclusion.mjs:85:3
Error: - process terminated with status 1, expected 0
at TestContext.<anonymous> (file:///Users/runner/work/node/node/node/test/parallel/test-runner-coverage-default-exclusion.mjs:92:5)
at Test.runInAsyncScope (node:async_hooks:227:14)
at Test.run (node:internal/test_runner/test:1402:25)
at async Suite.processPendingSubtests (node:internal/test_runner/test:974:7) {
options: {
env: {
NODE_TEST_TMPDIR: '/Users/runner/work/node/node/node/test/.tmp.3548'
},
cwd: '/Users/runner/work/node/node/node/test/.tmp.3548'
},
command: '/Users/runner/work/node/node/node/out/Release/node --test --experimental-test-coverage --disable-warning=ExperimentalWarning --test-reporter=tap'
}
Command: out/Release/node --test-reporter=./test/common/test-error-reporter.js --test-reporter-destination=stdout /Users/runner/work/node/node/node/test/parallel/test-runner-coverage-default-exclusion.mjs
|
|
test-macOS:
test/parallel/test-runner-cli.js#L101
--- stderr ---
node:internal/assert/utils:146
throw error;
^
AssertionError [ERR_ASSERTION]: The input did not match the regular expression /ok 4 - this should pass/. Input:
'TAP version 13\n' +
'# Subtest: this should pass\n' +
'ok 1 - this should pass\n' +
' ---\n' +
' duration_ms: 0.44375\n' +
" type: 'test'\n" +
' ...\n' +
'# Subtest: this should pass\n' +
'ok 2 - this should pass\n' +
' ---\n' +
' duration_ms: 0.059709\n' +
" type: 'test'\n" +
' ...\n' +
'# Subtest: this should pass\n' +
'ok 3 - this should pass\n' +
' ---\n' +
' duration_ms: 0.044667\n' +
" type: 'test'\n" +
' ...\n' +
'# Subtest: typescript-test.cts\n' +
'not ok 4 - typescript-test.cts\n' +
' ---\n' +
' duration_ms: 0.04575\n' +
" type: 'test'\n" +
" location: '/Users/runner/work/node/node/node/test/fixtures/test-runner/matching-patterns/typescript-test.cts:1:1'\n" +
` error: "Missing internal module 'internal/deps/./internal.js'"\n` +
" name: 'TypeError'\n" +
' stack: |-\n' +
' requireBuiltin (node:internal/bootstrap/realm:470:19)\n' +
' requireWithFallbackInDeps (node:internal/bootstrap/realm:482:10)\n' +
' node:internal/deps/amaro/dist/index:24:23\n' +
' BuiltinModule.compileForInternalLoader (node:internal/bootstrap/realm:440:7)\n' +
' requireBuiltin (node:internal/bootstrap/realm:471:14)\n' +
' node:internal/modules/typescript:36:17\n' +
' node:internal/util:777:15\n' +
' parseTypeScript (node:internal/modules/typescript:47:17)\n' +
' processTypeScriptCode (node:internal/modules/typescript:129:37)\n' +
' Object.stripTypeScriptModuleTypes (node:internal/modules/typescript:172:22)\n' +
' ...\n' +
'# Subtest: typescript-test.mts\n' +
'not ok 5 - typescript-test.mts\n' +
' ---\n' +
' duration_ms: 0.046917\n' +
" type: 'test'\n" +
" location: '/Users/runner/work/node/node/node/test/fixtures/test-runner/matching-patterns/typescript-test.mts:1:1'\n" +
` error: "Missing internal module 'internal/deps/./internal.js'"\n` +
" name: 'TypeError'\n" +
' stack: |-\n' +
' requireBuiltin (node:internal/bootstrap/realm:470:19)\n' +
' requireWithFallbackInDeps (node:internal/bootstrap/realm:482:10)\n' +
' node:internal/deps/amaro/dist/index:24:23\n' +
' BuiltinModule.compileForInternalLoader (node:internal/bootstrap/realm:440:7)\n' +
' requireBuiltin (node:internal/bootstrap/realm:471:14)\n' +
' node:internal/modules/typescript:36:17\n' +
' node:internal/util:777:15\n' +
' parseTypeScript (node:internal/modules/typescript:47:17)\n' +
' processTypeScriptCode (node:internal/modules/typescript:129:37)\n' +
' Object.stripTypeScriptModuleTypes (node:internal/modules/typescript:172:22)\n' +
' ...\n' +
'# Subtest: typescript-test.ts\n' +
'not ok 6 - typescript-test.ts\n' +
' ---\n' +
' duration_ms: 0.172167\n' +
" type: 'test'\n" +
" location: '/Users/runner/work/node/node/node/test/fixtures/test-runner/matching-patterns/typescript-test.ts:1:1'\n" +
` error: "Missing internal module 'internal/deps/./internal.js'"\n` +
" name: 'TypeError'\n" +
' stack: |-\n' +
' requireBuiltin (node:internal/bootstrap/realm:470:19)\n' +
' requireWithFallbackInDeps (node:internal/bootstrap/realm:482:10)\n' +
' node:internal/deps/amaro/dist/index:24:23\n' +
' BuiltinModule.compileForInternalLoader (node:internal/bootstrap/realm:440:7)\n' +
' requireBuiltin (node:internal/bootstrap/realm:471:14)\n' +
' node:internal/modules/typescript:36:17\n' +
' node:internal/util:777:15\n' +
' parseTypeScript (node:internal/modules/typescript:47:17)\n' +
' processTypeScriptCode (node:internal/modules/typescript:129:37)\n' +
' stripTypeScriptModuleTypes (node:internal/modules/typescript:172:22)\n' +
' ...\n' +
'1..6\n' +
'# tests 6\n' +
'# suites 0\n' +
'# pass 3\n' +
'# fail 3\n' +
'# cancelled 0\n' +
'# skipped 0\n' +
'# todo 0\n' +
'# duration_ms 20.185916\n'
at Object.<anonymous> (/Users/runner
|
|
test-macOS:
test/parallel/test-node-output-eval.mjs#L19
--- stdout ---
Test failure: 'eval/eval_messages.js'
Location: test/parallel/test-node-output-eval.mjs:18:5
AssertionError [ERR_ASSERTION]: Expected values to be strictly equal:
+ actual - expected
'[eval]\n' +
+ 'node:internal/process/execution:<line>\n' +
+ ' throw tsError;\n' +
+ ' ^\n' +
- '[eval]:1\n' +
- 'with(this){__filename}\n' +
- '^^^^\n' +
- "The 'with' statement is not supported. All symbols in a 'with' block will have type 'any'.\n" +
'\n' +
+ "TypeError: Missing internal module 'internal/deps/./internal.js'\n" +
- 'SyntaxError: Strict mode code may not include a with statement\n' +
' at <node-internal-frames>\n' +
'\n' +
'Node.js <node-version>\n' +
'42\n' +
'42\n' +
at assertSnapshot (/Users/runner/work/node/node/node/test/common/assertSnapshot.js:173:12)
at async Module.spawnAndAssert (/Users/runner/work/node/node/node/test/common/assertSnapshot.js:208:3)
at async TestContext.<anonymous> (file:///Users/runner/work/node/node/node/test/parallel/test-node-output-eval.mjs:19:7)
at async Test.run (node:internal/test_runner/test:1409:7)
at async Promise.all (index 0)
at async Suite.run (node:internal/test_runner/test:1905:7)
at async startSubtestAfterBootstrap (node:internal/test_runner/harness:387:3) {
generatedMessage: true,
code: 'ERR_ASSERTION',
actual: '[eval]\n' +
'node:internal/process/execution:<line>\n' +
' throw tsError;\n' +
' ^\n' +
'\n' +
"TypeError: Missing internal module 'internal/deps/./internal.js'\n" +
' at <node-internal-frames>\n' +
'\n' +
'Node.js <node-version>\n' +
'42\n' +
'...',
expected: '[eval]\n' +
'[eval]:1\n' +
'with(this){__filename}\n' +
'^^^^\n' +
"The 'with' statement is not supported. All symbols in a 'with' block will have type 'any'.\n" +
'\n' +
'SyntaxError: Strict mode code may not include a with statement\n' +
' at <node-internal-frames>\n' +
'\n' +
'Node.js <node-version>\n' +
'...',
operator: 'strictEqual',
diff: 'simple'
}
Test failure: 'eval/stdin_messages.js'
Location: test/parallel/test-node-output-eval.mjs:18:5
AssertionError [ERR_ASSERTION]: Expected values to be strictly equal:
+ actual - expected
'[stdin]\n' +
+ 'node:internal/process/execution:<line>\n' +
+ ' throw tsError;\n' +
+ ' ^\n' +
- '[stdin]:1\n' +
- 'with(this){__filename}\n' +
- '^^^^\n' +
- "The 'with' statement is not supported. All symbols in a 'with' block will have type 'any'.\n" +
'\n' +
+ "TypeError: Missing internal module 'internal/deps/./internal.js'\n" +
- 'SyntaxError: Strict mode code may not include a with statement\n' +
' at <node-internal-frames>\n' +
'\n' +
'Node.js <node-version>\n' +
'42\n' +
'42\n' +
at assertSnapshot (/Users/runner/work/node/node/node/test/common/assertSnapshot.js:173:12)
at async Module.spawnAndAssert (/Users/runner/work/node/node/node/test/common/assertSnapshot.js:208:3)
at async TestContext.<anonymous> (file:///Users/runner/work/node/node/node/test/parallel/test-node-output-eval.mjs:19:7)
at async Test.run (node:internal/test_runner/test:1409:7)
at async Promise.all (index 1)
at async Suite.run (node:internal/test_runner/test:1905:7)
at async startSubtestAfterBootstrap (node:internal/test_runner/harness:387:3) {
generatedMessage: true,
code: 'ERR_ASSERTION',
actual: '[stdin]\n' +
'node:internal/process/execution:<line>\n' +
' throw tsError;\n' +
' ^\n' +
'\n' +
"TypeError: Missing internal module 'internal/deps/./internal.js'\n" +
' at <node-internal-frames>\n' +
'\n' +
'Node.js <node-version>\n' +
'42\n' +
'...',
expected: '[stdin]\n' +
'[stdin]:1\n' +
'with(this){__filename}\n' +
'^^^^\n' +
"The 'with' statement is not supported. All symbols in a 'with' block will have type 'any'.\n" +
'\n' +
'SyntaxError: Strict mode code may not include a with statement\n' +
' at <node-internal-frames>\
|
|
test-macOS:
test/parallel/test-module-strip-types.js#L0
--- stderr ---
(node:73068) ExperimentalWarning: stripTypeScriptTypes is an experimental feature and might change at any time
(Use `node --trace-warnings ...` to show where the warning was created)
--- stdout ---
Test failure: 'stripTypeScriptTypes'
Location: test/parallel/test-module-strip-types.js:14:1
TypeError: Missing internal module 'internal/deps/./internal.js'
at requireBuiltin (node:internal/bootstrap/realm:470:19)
at requireWithFallbackInDeps (node:internal/bootstrap/realm:482:10)
at node:internal/deps/amaro/dist/index:24:23
at BuiltinModule.compileForInternalLoader (node:internal/bootstrap/realm:440:7)
at requireBuiltin (node:internal/bootstrap/realm:471:14)
at node:internal/modules/typescript:36:17
at node:internal/util:777:15
at parseTypeScript (node:internal/modules/typescript:47:17)
at processTypeScriptCode (node:internal/modules/typescript:129:37)
at stripTypeScriptTypes (node:internal/modules/typescript:111:10)
Test failure: 'stripTypeScriptTypes explicit'
Location: test/parallel/test-module-strip-types.js:20:1
TypeError: Missing internal module 'internal/deps/./internal.js'
at requireBuiltin (node:internal/bootstrap/realm:470:19)
at requireWithFallbackInDeps (node:internal/bootstrap/realm:482:10)
at node:internal/deps/amaro/dist/index:24:23
at BuiltinModule.compileForInternalLoader (node:internal/bootstrap/realm:440:7)
at requireBuiltin (node:internal/bootstrap/realm:471:14)
at node:internal/modules/typescript:36:17
at node:internal/util:777:15
at parseTypeScript (node:internal/modules/typescript:47:17)
at processTypeScriptCode (node:internal/modules/typescript:129:37)
at stripTypeScriptTypes (node:internal/modules/typescript:111:10)
Test failure: 'stripTypeScriptTypes sourceUrl throws when mode is strip'
Location: test/parallel/test-module-strip-types.js:43:1
TypeError: Missing internal module 'internal/deps/./internal.js'
at requireBuiltin (node:internal/bootstrap/realm:470:19)
at requireWithFallbackInDeps (node:internal/bootstrap/realm:482:10)
at node:internal/deps/amaro/dist/index:24:23
at BuiltinModule.compileForInternalLoader (node:internal/bootstrap/realm:440:7)
at requireBuiltin (node:internal/bootstrap/realm:471:14)
at node:internal/modules/typescript:36:17
at node:internal/util:777:15
at parseTypeScript (node:internal/modules/typescript:47:17)
at processTypeScriptCode (node:internal/modules/typescript:129:37)
at stripTypeScriptTypes (node:internal/modules/typescript:111:10)
Command: out/Release/node --test-reporter=./test/common/test-error-reporter.js --test-reporter-destination=stdout /Users/runner/work/node/node/node/test/parallel/test-module-strip-types.js
|
|
test-macOS:
test/parallel/test-inspector-strip-types.js#L88
--- stderr ---
1
--- stdout ---
[test] Connecting to a child Node process
[test] Testing /json/list
[err] Debugger listening on ws://127.0.0.1:59222/b55f4aa3-e18f-4d73-ae41-9d5c996524aa
[err] For help, see: https://nodejs.org/learn/getting-started/debugging
[err]
[err] Debugger attached.
[err]
[err] Waiting for the debugger to disconnect...
[err]
[err] node:internal/bootstrap/realm:470
[err] if (!mod) throw new TypeError(`Missing internal module '${id}'`);
[err] ^
[err]
[err] TypeError: Missing internal module 'internal/deps/./internal.js'
[err] at requireBuiltin (node:internal/bootstrap/realm:470:19)
[err] at requireWithFallbackInDeps (node:internal/bootstrap/realm:482:10)
[err] at node:internal/deps/amaro/dist/index:24:23
[err] at BuiltinModule.compileForInternalLoader (node:internal/bootstrap/realm:440:7)
[err] at requireBuiltin (node:internal/bootstrap/realm:471:14)
[err] at node:internal/modules/typescript:36:17
[err] at node:internal/util:777:15
[err] at parseTypeScript (node:internal/modules/typescript:47:17)
[err] at processTypeScriptCode (node:internal/modules/typescript:129:37)
[err] at Object.stripTypeScriptModuleTypes (node:internal/modules/typescript:172:22)
[err]
[err] Node.js v27.0.0-pre
[err]
[test] Connecting to a child Node process
[test] Testing /json/list
Test failure: 'typescript/ts/test-typescript.ts'
Location: test/parallel/test-inspector-strip-types.js:94:5
AssertionError [ERR_ASSERTION]: Expected values to be strictly equal:
1 !== 0
at collectParsedScripts (/Users/runner/work/node/node/node/test/parallel/test-inspector-strip-types.js:88:10)
at process.processTicksAndRejections (node:internal/process/task_queues:104:5)
at async TestContext.<anonymous> (/Users/runner/work/node/node/node/test/parallel/test-inspector-strip-types.js:95:23)
at async Test.run (node:internal/test_runner/test:1409:7)
at async Promise.all (index 0)
at async Suite.run (node:internal/test_runner/test:1905:7)
at async startSubtestAfterBootstrap (node:internal/test_runner/harness:387:3) {
generatedMessage: true,
code: 'ERR_ASSERTION',
actual: 1,
expected: 0,
operator: 'strictEqual',
diff: 'simple'
}
[err] Debugger listening on ws://127.0.0.1:59261/986b8de5-2a3d-4d9b-821c-28b4ab553e0a
[err] For help, see: https://nodejs.org/learn/getting-started/debugging
[err]
[err] Debugger attached.
[err]
[err] Waiting for the debugger to disconnect...
[err]
[err] node:internal/bootstrap/realm:470
[err] if (!mod) throw new TypeError(`Missing internal module '${id}'`);
[err] ^
[err]
[err] TypeError: Missing internal module 'internal/deps/./internal.js'
[err] at requireBuiltin (node:internal/bootstrap/realm:470:19)
[err] at requireWithFallbackInDeps (node:internal/bootstrap/realm:482:10)
[err] at node:internal/deps/amaro/dist/index:24:23
[err] at BuiltinModule.compileForInternalLoader (node:internal/bootstrap/realm:440:7)
[err] at requireBuiltin (node:internal/bootstrap/realm:471:14)
[err] at node:internal/modules/typescript:36:17
[err] at node:internal/util:777:15
[err] at parseTypeScript (node:internal/modules/typescript:47:17)
[err] at processTypeScriptCode (node:internal/modules/typescript:129:37)
[err] at Object.stripTypeScriptModuleTypes (node:internal/modules/typescript:172:22)
[err]
[err] Node.js v27.0.0-pre
[err]
[test] Connecting to a child Node process
[test] Testing /json/list
Test failure: 'typescript/ts/test-require-cts.ts'
Location: test/parallel/test-inspector-strip-types.js:94:5
AssertionError [ERR_ASSERTION]: Expected values to be strictly equal:
1 !== 0
at collectParsedScripts (/Users/runner/work/node/node/node/test/parallel/test-inspector-strip-types.js:88:10)
at process.processTicksAndRejections (node:internal/process/task_queues:104:5)
at async TestContext.<anonymous> (/Users/runner/work/node/node/node/test/parallel/test-inspector-strip-types.js:95:23)
at async Test.run (node:internal/test_runner/test:1409:7)
at async Suite.processPendingSu
|
|
test-macOS:
test/parallel/test-debugger-probe-typescript.js#L24
--- stderr ---
[process 67151]: --- stderr ---
[process 67151]: --- stdout ---
{"v":2,"probes":[{"expr":"x","target":{"suffix":"probe-typescript.ts","line":9}},{"expr":"y","target":{"suffix":"probe-typescript.ts","line":9}}],"results":[{"event":"error","pending":[0,1],"error":{"code":"probe_target_exit","message":"Target exited with code 1 before probes: probe-typescript.ts:9","exitCode":1,"stderr":"node:internal/bootstrap/realm:470\n if (!mod) throw new TypeError(`Missing internal module '${id}'`);\n ^\n\nTypeError: Missing internal module 'internal/deps/./internal.js'\n at requireBuiltin (node:internal/bootstrap/realm:470:19)\n at requireWithFallbackInDeps (node:internal/bootstrap/realm:482:10)\n at node:internal/deps/amaro/dist/index:24:23\n at BuiltinModule.compileForInternalLoader (node:internal/bootstrap/realm:440:7)\n at requireBuiltin (node:internal/bootstrap/realm:471:14)\n at node:internal/modules/typescript:36:17\n at node:internal/util:777:15\n at parseTypeScript (node:internal/modules/typescript:47:17)\n at processTypeScriptCode (node:internal/modules/typescript:129:37)\n at Object.stripTypeScriptModuleTypes (node:internal/modules/typescript:172:22)\n\nNode.js v27.0.0-pre"}}]}
[process 67151]: status = 0, signal = null
/Users/runner/work/node/node/node/test/common/child_process.js:112
throw error;
^
Error: - stdout did not match expectation, checker throws:
AssertionError [ERR_ASSERTION]: Expected values to be strictly deep-equal:
+ actual - expected
... Skipped lines
{
probes: [
{
expr: 'x',
target: {
...
{
+ error: {
+ code: 'probe_target_exit',
+ exitCode: 1,
+ message: 'Target exited with code 1 before probes: probe-typescript.ts:9',
+ stderr: 'node:internal/bootstrap/realm:470\n' +
+ " if (!mod) throw new TypeError(`Missing internal module '${id}'`);\n" +
+ ' ^\n' +
+ '\n' +
+ "TypeError: Missing internal module 'internal/deps/./internal.js'\n" +
+ '<stack>\n' +
+ '\n' +
+ 'Node.js <version>'
- event: 'hit',
- hit: 1,
- location: {
- column: 24,
- line: 9,
- url: 'file:///Users/runner/work/node/node/node/test/fixtures/debugger/probe-typescript.ts'
},
+ event: 'error',
+ pending: [
+ 0,
+ 1
+ ]
- probe: 0,
- result: {
- description: '7',
- type: 'number',
- value: 7
- }
},
- {
- event: 'hit',
- hit: 1,
- location: {
- column: 24,
- line: 9,
- url: 'file:///Users/runner/work/node/node/node/test/fixtures/debugger/probe-typescript.ts'
- },
- probe: 1,
- result: {
- description: '8',
- type: 'number',
- value: 8
- }
- },
- {
- event: 'completed'
- }
],
v: 2
}
at assertProbeJson (/Users/runner/work/node/node/node/test/common/debugger-probe.js:73:10)
at stdout (/Users/runner/work/node/node/node/test/parallel/test-debugger-probe-typescript.js:24:5)
at checkOutput (/Users/runner/work/node/node/node/test/common/child_process.js:52:7)
at expectSyncExit (/Users/runner/work/node/node/node/test/common/child_process.js:129:32)
at spawnSyncAndAssert (/Users/runner/work/node/node/node/test/common/child_process.js:155:10)
at Object.<anonymous> (/Users/runner/work/node/node/node/test/parallel/test-debugger-probe-typescript.js:14:1)
at Module._compile (node:internal/modules/cjs/loader:1968:14)
at Object..js (node:internal/modules/cjs/loader:2108:10)
at Module.load (node:internal/modules/cjs/loader:1690:32)
at Module._load (node:internal/modules/cjs/loader:1480:12) {
generatedMessage: true,
code: 'ERR_ASSERTION',
actual: [Object],
expected: [Object],
operator: 'deepStrictEqual',
diff: 'simple'
}
at Object.<anonymous> (/Users/runner/work/node/node/node/test/parallel/test-debugger-probe-typescript.js:14:1)
at Mod
|
|
test-macOS:
test/parallel/test-config-file.js#L290
--- stdout ---
Test failure: 'should parse boolean flag'
Location: test/parallel/test-config-file.js:285:1
AssertionError [ERR_ASSERTION]: The input did not match the regular expression /--experimental-config-file is an experimental feature and might change at any time/. Input:
'node:internal/bootstrap/realm:470\n' +
" if (!mod) throw new TypeError(`Missing internal module '${id}'`);\n" +
' ^\n' +
'\n' +
"TypeError: Missing internal module 'internal/deps/./internal.js'\n" +
' at requireBuiltin (node:internal/bootstrap/realm:470:19)\n' +
' at requireWithFallbackInDeps (node:internal/bootstrap/realm:482:10)\n' +
' at node:internal/deps/amaro/dist/index:24:23\n' +
' at BuiltinModule.compileForInternalLoader (node:internal/bootstrap/realm:440:7)\n' +
' at requireBuiltin (node:internal/bootstrap/realm:471:14)\n' +
' at node:internal/modules/typescript:36:17\n' +
' at node:internal/util:777:15\n' +
' at parseTypeScript (node:internal/modules/typescript:47:17)\n' +
' at processTypeScriptCode (node:internal/modules/typescript:129:37)\n' +
' at Object.stripTypeScriptModuleTypes (node:internal/modules/typescript:172:22)\n' +
'\n' +
'Node.js v27.0.0-pre\n'
at TestContext.<anonymous> (/Users/runner/work/node/node/node/test/parallel/test-config-file.js:290:10)
at async Test.run (node:internal/test_runner/test:1409:7)
at async Test.processPendingSubtests (node:internal/test_runner/test:974:7) {
generatedMessage: true,
code: 'ERR_ASSERTION',
actual: 'node:internal/bootstrap/realm:470\n' +
" if (!mod) throw new TypeError(`Missing internal module '${id}'`);\n" +
' ^\n' +
'\n' +
"TypeError: Missing internal module 'internal/deps/./internal.js'\n" +
' at requireBuiltin (node:internal/bootstrap/realm:470:19)\n' +
' at requireWithFallbackInDeps (node:internal/bootstrap/realm:482:10)\n' +
' at node:internal/deps/amaro/dist/index:24:23\n' +
' at BuiltinModule.compileForInternalLoader (node:internal/bootstrap/realm:440:7)\n' +
' at requireBuiltin (node:internal/bootstrap/realm:471:14)\n' +
'...',
expected: /--experimental-config-file is an experimental feature and might change at any time/,
operator: 'match',
diff: 'simple'
}
Command: out/Release/node --test-reporter=./test/common/test-error-reporter.js --test-reporter-destination=stdout /Users/runner/work/node/node/node/test/parallel/test-config-file.js
|
|
test-macOS:
test/parallel/test-compile-cache-typescript-strip-sourcemaps.js#L19
--- stderr ---
[process 64968]: --- stderr ---
[compile cache] resolved path /Users/runner/work/node/node/node/test/.tmp.496/.compile_cache_dir + v27.0.0-pre-arm64-310b2ce3-501 -> /Users/runner/work/node/node/node/test/.tmp.496/.compile_cache_dir/v27.0.0-pre-arm64-310b2ce3-501
[compile cache] creating cache directory /Users/runner/work/node/node/node/test/.tmp.496/.compile_cache_dir/v27.0.0-pre-arm64-310b2ce3-501...success
[compile cache] reading cache from /Users/runner/work/node/node/node/test/.tmp.496/.compile_cache_dir/v27.0.0-pre-arm64-310b2ce3-501/58b090a5 for StrippedTypeScript /Users/runner/work/node/node/node/test/fixtures/typescript/ts/test-typescript.ts... no such file or directory
[compile cache] no transpile cache for StrippedTypeScript /Users/runner/work/node/node/node/test/fixtures/typescript/ts/test-typescript.ts
node:internal/bootstrap/realm:470
if (!mod) throw new TypeError(`Missing internal module '${id}'`);
^
TypeError: Missing internal module 'internal/deps/./internal.js'
at requireBuiltin (node:internal/bootstrap/realm:470:19)
at requireWithFallbackInDeps (node:internal/bootstrap/realm:482:10)
at node:internal/deps/amaro/dist/index:24:23
at BuiltinModule.compileForInternalLoader (node:internal/bootstrap/realm:440:7)
at requireBuiltin (node:internal/bootstrap/realm:471:14)
at node:internal/modules/typescript:36:17
at node:internal/util:777:15
at parseTypeScript (node:internal/modules/typescript:47:17)
at processTypeScriptCode (node:internal/modules/typescript:129:37)
at Object.stripTypeScriptModuleTypes (node:internal/modules/typescript:172:22)
Node.js v27.0.0-pre
[compile cache] skip persisting StrippedTypeScript /Users/runner/work/node/node/node/test/fixtures/typescript/ts/test-typescript.ts because the cache was not initialized
[compile cache] Clear deserialized cache.
[process 64968]: --- stdout ---
[process 64968]: status = 1, signal = null
/Users/runner/work/node/node/node/test/common/child_process.js:112
throw error;
^
Error: - process terminated with status 1, expected 0
at Object.<anonymous> (/Users/runner/work/node/node/node/test/parallel/test-compile-cache-typescript-strip-sourcemaps.js:19:1)
at Module._compile (node:internal/modules/cjs/loader:1968:14)
at Object..js (node:internal/modules/cjs/loader:2108:10)
at Module.load (node:internal/modules/cjs/loader:1690:32)
at Module._load (node:internal/modules/cjs/loader:1480:12)
at wrapModuleLoad (node:internal/modules/cjs/loader:261:19)
at Module.executeUserEntryPoint [as runMain] (node:internal/modules/run_main:171:5)
at node:internal/main/run_main_module:33:47 {
options: {
env: {
NODE_DEBUG_NATIVE: 'COMPILE_CACHE',
NODE_COMPILE_CACHE: '/Users/runner/work/node/node/node/test/.tmp.496/.compile_cache_dir'
},
cwd: '/Users/runner/work/node/node/node/test/.tmp.496'
},
command: '/Users/runner/work/node/node/node/out/Release/node /Users/runner/work/node/node/node/test/fixtures/typescript/ts/test-typescript.ts'
}
Node.js v27.0.0-pre
Command: out/Release/node /Users/runner/work/node/node/node/test/parallel/test-compile-cache-typescript-strip-sourcemaps.js
|
|
test-macOS:
test/parallel/test-compile-cache-typescript-esm.js#L20
--- stderr ---
[process 64959]: --- stderr ---
[compile cache] resolved path /Users/runner/work/node/node/node/test/.tmp.495/.compile_cache_dir + v27.0.0-pre-arm64-310b2ce3-501 -> /Users/runner/work/node/node/node/test/.tmp.495/.compile_cache_dir/v27.0.0-pre-arm64-310b2ce3-501
[compile cache] creating cache directory /Users/runner/work/node/node/node/test/.tmp.495/.compile_cache_dir/v27.0.0-pre-arm64-310b2ce3-501...success
[compile cache] reading cache from /Users/runner/work/node/node/node/test/.tmp.495/.compile_cache_dir/v27.0.0-pre-arm64-310b2ce3-501/4d251c33 for StrippedTypeScript /Users/runner/work/node/node/node/test/fixtures/typescript/ts/test-module-typescript.ts... no such file or directory
[compile cache] no transpile cache for StrippedTypeScript /Users/runner/work/node/node/node/test/fixtures/typescript/ts/test-module-typescript.ts
node:internal/bootstrap/realm:470
if (!mod) throw new TypeError(`Missing internal module '${id}'`);
^
TypeError: Missing internal module 'internal/deps/./internal.js'
at requireBuiltin (node:internal/bootstrap/realm:470:19)
at requireWithFallbackInDeps (node:internal/bootstrap/realm:482:10)
at node:internal/deps/amaro/dist/index:24:23
at BuiltinModule.compileForInternalLoader (node:internal/bootstrap/realm:440:7)
at requireBuiltin (node:internal/bootstrap/realm:471:14)
at node:internal/modules/typescript:36:17
at node:internal/util:777:15
at parseTypeScript (node:internal/modules/typescript:47:17)
at processTypeScriptCode (node:internal/modules/typescript:129:37)
at Object.stripTypeScriptModuleTypes (node:internal/modules/typescript:172:22)
Node.js v27.0.0-pre
[compile cache] skip persisting StrippedTypeScript /Users/runner/work/node/node/node/test/fixtures/typescript/ts/test-module-typescript.ts because the cache was not initialized
[compile cache] Clear deserialized cache.
[process 64959]: --- stdout ---
[process 64959]: status = 1, signal = null
/Users/runner/work/node/node/node/test/common/child_process.js:112
throw error;
^
Error: - process terminated with status 1, expected 0
at Object.<anonymous> (/Users/runner/work/node/node/node/test/parallel/test-compile-cache-typescript-esm.js:20:3)
at Module._compile (node:internal/modules/cjs/loader:1968:14)
at Object..js (node:internal/modules/cjs/loader:2108:10)
at Module.load (node:internal/modules/cjs/loader:1690:32)
at Module._load (node:internal/modules/cjs/loader:1480:12)
at wrapModuleLoad (node:internal/modules/cjs/loader:261:19)
at Module.executeUserEntryPoint [as runMain] (node:internal/modules/run_main:171:5)
at node:internal/main/run_main_module:33:47 {
options: {
env: {
NODE_DEBUG_NATIVE: 'COMPILE_CACHE',
NODE_COMPILE_CACHE: '/Users/runner/work/node/node/node/test/.tmp.495/.compile_cache_dir'
},
cwd: '/Users/runner/work/node/node/node/test/.tmp.495'
},
command: '/Users/runner/work/node/node/node/out/Release/node /Users/runner/work/node/node/node/test/fixtures/typescript/ts/test-module-typescript.ts'
}
Node.js v27.0.0-pre
Command: out/Release/node /Users/runner/work/node/node/node/test/parallel/test-compile-cache-typescript-esm.js
|
|
test-macOS:
test/parallel/test-compile-cache-typescript-commonjs.js#L20
--- stderr ---
[process 64711]: --- stderr ---
[compile cache] resolved path /Users/runner/work/node/node/node/test/.tmp.493/.compile_cache_dir + v27.0.0-pre-arm64-310b2ce3-501 -> /Users/runner/work/node/node/node/test/.tmp.493/.compile_cache_dir/v27.0.0-pre-arm64-310b2ce3-501
[compile cache] creating cache directory /Users/runner/work/node/node/node/test/.tmp.493/.compile_cache_dir/v27.0.0-pre-arm64-310b2ce3-501...success
[compile cache] reading cache from /Users/runner/work/node/node/node/test/.tmp.493/.compile_cache_dir/v27.0.0-pre-arm64-310b2ce3-501/85d0aec8 for StrippedTypeScript /Users/runner/work/node/node/node/test/fixtures/typescript/ts/test-commonjs-parsing.ts... no such file or directory
[compile cache] no transpile cache for StrippedTypeScript /Users/runner/work/node/node/node/test/fixtures/typescript/ts/test-commonjs-parsing.ts
node:internal/bootstrap/realm:470
if (!mod) throw new TypeError(`Missing internal module '${id}'`);
^
TypeError: Missing internal module 'internal/deps/./internal.js'
at requireBuiltin (node:internal/bootstrap/realm:470:19)
at requireWithFallbackInDeps (node:internal/bootstrap/realm:482:10)
at node:internal/deps/amaro/dist/index:24:23
at BuiltinModule.compileForInternalLoader (node:internal/bootstrap/realm:440:7)
at requireBuiltin (node:internal/bootstrap/realm:471:14)
at node:internal/modules/typescript:36:17
at node:internal/util:777:15
at parseTypeScript (node:internal/modules/typescript:47:17)
at processTypeScriptCode (node:internal/modules/typescript:129:37)
at Object.stripTypeScriptModuleTypes (node:internal/modules/typescript:172:22)
Node.js v27.0.0-pre
[compile cache] skip persisting StrippedTypeScript /Users/runner/work/node/node/node/test/fixtures/typescript/ts/test-commonjs-parsing.ts because the cache was not initialized
[compile cache] Clear deserialized cache.
[process 64711]: --- stdout ---
[process 64711]: status = 1, signal = null
/Users/runner/work/node/node/node/test/common/child_process.js:112
throw error;
^
Error: - process terminated with status 1, expected 0
at Object.<anonymous> (/Users/runner/work/node/node/node/test/parallel/test-compile-cache-typescript-commonjs.js:20:3)
at Module._compile (node:internal/modules/cjs/loader:1968:14)
at Object..js (node:internal/modules/cjs/loader:2108:10)
at Module.load (node:internal/modules/cjs/loader:1690:32)
at Module._load (node:internal/modules/cjs/loader:1480:12)
at wrapModuleLoad (node:internal/modules/cjs/loader:261:19)
at Module.executeUserEntryPoint [as runMain] (node:internal/modules/run_main:171:5)
at node:internal/main/run_main_module:33:47 {
options: {
env: {
NODE_DEBUG_NATIVE: 'COMPILE_CACHE',
NODE_COMPILE_CACHE: '/Users/runner/work/node/node/node/test/.tmp.493/.compile_cache_dir'
},
cwd: '/Users/runner/work/node/node/node/test/.tmp.493'
},
command: '/Users/runner/work/node/node/node/out/Release/node /Users/runner/work/node/node/node/test/fixtures/typescript/ts/test-commonjs-parsing.ts'
}
Node.js v27.0.0-pre
Command: out/Release/node /Users/runner/work/node/node/node/test/parallel/test-compile-cache-typescript-commonjs.js
|
|
sccache stats - test-macOS
45% - 2284 hits, 2779 misses, 0 errors
|
|
test-macOS
Due to capacity constraints, jobs targeting macOS arm64 runners may experience longer queue times.
|